{"text_format":"1","workbook":"xlsx","n_sheets":18,"sheets":["Introduction","Main Menu","Other Factors","Bridges","Output Bridges","HiddenBridges","Earthwork","Output Earthwork","HiddenEarthwork","Asphalt Paving","Output AP","HiddenAP","Concrete Paving","Output CP","Hidden CP","Miscellaneous Activities","Output Misc.","Hidden Misc."],"not_rendered":{"charts":184,"images":17,"macros":1,"external_links":0,"defined_names":9,"comments":5,"pivot_tables":0},"unopened":[],"bounds":{"document_bytes":16777216,"sheet_cells":100000,"rows_first":2000,"rows_last":500,"rows_between":2000,"halvings":0,"cell_chars":16384,"cell_head_chars":4096},"cells_cut":0,"cells_raw":0,"read":"whole","date_system":"1900"}

{"sheet":"Introduction","index":0,"n_rows":0,"n_cols":0,"rows_kept":0,"cut":false,"hidden":false,"merged":[]}

{"sheet":"Main Menu","index":1,"n_rows":20,"n_cols":12,"rows_kept":20,"cut":false,"hidden":true,"merged":[]}
[]
[]
[]
[]
[]
[]
[]
[]
[]
[]
[]
[]
[]
[]
[]
[null,null,null,null,null,null,null,null,null,null,null,"Project ID"]
[null,null,null,null,null,null,null,null,null,null,null,"Project Location"]
[null,null,null,null,null,null,null,null,null,null,null,"Date"]
[null,null,null,null,null,null,null,null,null,null,null,"Description"]
[null,null,null,null,null,null,null,null,null,null,null,"Name/Initials of Respondent"]
{"$rows_left_out":1}
{"sheet":"Other Factors","index":2,"n_rows":0,"n_cols":0,"rows_kept":0,"cut":false,"hidden":true,"merged":[]}

{"sheet":"Bridges","index":3,"n_rows":36,"n_cols":6,"rows_kept":36,"cut":false,"hidden":true,"merged":[[40,5,42,5],[23,2,23,4],[24,2,24,4],[26,2,26,4],[27,2,27,4],[28,2,28,4],[29,2,29,4],[30,2,30,4],[25,2,25,4],[31,2,31,4],[32,2,32,4],[33,2,33,4],[34,2,34,4],[35,2,35,4]]}
[]
[]
[]
[]
[]
[]
[]
[]
[]
[]
[]
[]
[null,"Project ID",{"$f":"IF('Main Menu'!M16=\"\",\"\",'Main Menu'!M16)","v":""}]
[null,"Project Location",{"$f":"IF('Main Menu'!M17=\"\",\"\",'Main Menu'!M17)","v":""}]
[null,"Date",{"$f":"IF('Main Menu'!M18=\"\",\"\",'Main Menu'!M18)","v":""}]
[null,"Description",{"$f":"IF('Main Menu'!M19=\"\",\"\",'Main Menu'!M19)","v":""}]
[null,"Name/Initials of Respondent",{"$f":"IF('Main Menu'!M20=\"\",\"\",'Main Menu'!M20)","v":""}]
[]
[]
[]
{"$rows_left_out":17}
{"sheet":"Output Bridges","index":4,"n_rows":105,"n_cols":7,"rows_kept":105,"cut":false,"hidden":true,"merged":[[62,0,67,0],[68,0,77,0],[78,0,95,0],[24,3,24,6],[40,3,40,6],[25,1,25,2],[26,1,28,2],[29,1,31,2],[32,1,34,2],[35,1,37,2],[41,1,41,2],[42,1,43,2],[52,1,53,2],[50,1,51,2],[48,1,49,2],[43,3,43,6],[44,1,45,2],[45,3,45,6],[46,1,47,2],[42,0,61,0],[47,3,47,6],[49,3,49,6],[51,3,51,6],[53,3,53,6],[55,3,55,6],[57,3,57,6],[59,3,59,6],[61,3,61,6],[58,1,59,2],[56,1,57,2],[54,1,55,2],[63,3,63,6],[65,3,65,6],[67,3,67,6],[69,3,69,6],[71,3,71,6],[73,3,73,6],[75,3,75,6],[77,3,77,6],[79,3,79,6],[81,3,81,6],[83,3,83,6],[85,3,85,6],[87,3,87,6],[89,3,89,6],[91,3,91,6],[93,3,93,6],[95,3,95,6],[94,1,95,2],[92,1,93,2],[90,1,91,2],[88,1,89,2],[86,1,87,2],[84,1,85,2],[82,1,83,2],[80,1,81,2],[78,1,79,2],[76,1,77,2],[74,1,75,2],[72,1,73,2],[70,1,71,2],[68,1,69,2],[66,1,67,2],[64,1,65,2],[62,1,63,2],[60,1,61,2]]}
[]
[]
[]
[]
[]
[]
[]
[]
[]
[]
[]
[null,"Project ID",{"$f":"IF(Bridges!C13=\"\",\"\",Bridges!C13)","v":""}]
[null,"Project Location",{"$f":"IF(Bridges!C14=\"\",\"\",Bridges!C14)","v":""}]
[null,"Date",{"$f":"IF(Bridges!C15=\"\",\"\",Bridges!C15)","v":""}]
[null,"Description",{"$f":"IF(Bridges!C16=\"\",\"\",Bridges!C16)","v":""}]
[null,"Name/Initials of Respondent",{"$f":"IF(Bridges!C17=\"\",\"\",Bridges!C17)","v":""}]
[]
[]
[]
[]
{"$rows_left_out":86}
{"sheet":"HiddenBridges","index":5,"n_rows":120,"n_cols":21,"rows_kept":120,"cut":false,"hidden":true,"merged":[[118,13,118,19],[119,13,119,19],[96,13,96,19],[97,13,97,19],[113,13,113,19],[114,13,114,19],[115,13,115,19],[116,13,116,19],[117,13,117,19],[108,13,108,19],[109,13,109,19],[110,13,110,19],[111,13,111,19],[112,13,112,19],[103,13,103,19],[104,13,104,19],[105,13,105,19],[106,13,106,19],[107,13,107,19],[98,13,98,19],[99,13,99,19],[100,13,100,19],[101,13,101,19],[102,13,102,19],[118,7,118,8],[119,7,119,8],[108,7,108,8],[109,7,109,8],[110,7,110,8],[111,7,111,8],[112,7,112,8],[113,7,113,8],[114,7,114,8],[115,7,115,8],[116,7,116,8],[117,7,117,8],[98,7,98,8],[99,7,99,8],[100,7,100,8],[101,7,101,8],[102,7,102,8],[103,7,103,8],[104,7,104,8],[105,7,105,8],[106,7,106,8],[107,7,107,8],[58,0,58,2],[5,16,5,17],[6,0,6,2],[6,8,6,9],[23,0,23,2],[40,0,40,2],[0,9,0,11],[97,7,97,8],[83,7,84,13],[93,7,93,8],[94,7,94,8],[95,7,95,8],[96,7,96,8],[95,13,95,19],[94,13,94,19],[93,13,93,19]]}
[null,null,null,null,null,null,null,null,null,"For Dropdown Menus"]
[null,null,null,null,null,null,null,null,null,1]
[null,null,null,null,null,null,null,null,null,2]
[null,null,null,null,null,null,null,null,null,3]
[null,null,"Determine whether you would like to have narrow spread, medium spread or large spread for your estimate."]
[null,null,null,null,null,null,null,null,null,null,null,null,null,null,null,null,"Boundaries"]
["Dependent Variable 1: Concrete Masonry",null,null,null,null,null,null,null,"x-new (user input)",null,null,null,"Estimate of Ῡ",null,null,null,"MIN","MAX"]
[]
[]
["Factors","Estimated Coef.",null,null,null,null,null,null,"Possible values","Input x0",null,null,null,null,null,null,null,null,null,null,"Concrete Masonry"]
["(Intercept)  ",2.5234999999999999,null,null,null,null,null,"(Intercept)",1,1,null,null,{"$f":"B11+B12*J12+B13*J13","v":2.5234999999999999},null,null,null,0.2,4,null,"min",0.2]
["StagedConstruction",-1.0335000000000001,null,null,null,null,null,"StagedConstruction","1, 2 or 3",{"$f":"Bridges!F34","v":0},null,null,null,null,null,null,null,null,null,"Q1",0.625]
["Project Constraints",0.76170000000000004,null,null,null,null,null,"Project Constraints","1, 2 or 3",{"$f":"Bridges!F32","v":0},null,null,null,null,null,null,null,null,null,"Median",1.65]
[null,null,null,null,null,null,null,null,null,null,null,null,null,null,null,null,null,null,null,"Q3",2]
[null,null,null,null,null,null,null,null,null,null,null,null,null,null,null,null,null,null,null,"Max",4]
[]
[null,null,null,null,null,null,null,null,null,null,null,null,null,null,null,null,null,null,null,"Box1 - hidden",{"$f":"U12","v":0.625}]
[null,null,null,null,null,null,null,null,null,null,null,null,null,null,null,null,null,null,null,"Box 2 - lower",{"$f":"U13-U12","v":1.0249999999999999}]
[null,null,null,null,null,null,null,null,null,null,null,null,null,null,null,null,null,null,null,"Bow 3 - upper",{"$f":"U14-U13","v":0.35000000000000009}]
[null,null,null,null,null,null,null,null,null,null,null,null,null,null,null,null,null,null,null,"Estimate x mark",{"$f":"M11","v":2.5234999999999999}]
{"$rows_left_out":101}
{"sheet":"Earthwork","index":6,"n_rows":36,"n_cols":6,"rows_kept":36,"cut":false,"hidden":true,"merged":[[30,2,30,4],[29,2,29,4],[23,2,23,4],[31,2,31,4],[3,2,5,3],[25,2,25,4],[21,2,21,4],[28,2,28,4],[27,2,27,4],[26,2,26,4],[24,2,24,4],[22,2,22,4],[35,2,35,4],[33,2,33,4],[32,2,32,4],[34,2,34,4],[39,5,41,5]]}
[]
[]
[]
[]
[]
[]
[]
[]
[]
[]
[null,"Project ID",{"$f":"IF('Main Menu'!M16=\"\",\"\",'Main Menu'!M16)","v":""}]
[null,"Project Location",{"$f":"IF('Main Menu'!M17=\"\",\"\",'Main Menu'!M17)","v":""}]
[null,"Date",{"$f":"IF('Main Menu'!M18=\"\",\"\",'Main Menu'!M18)","v":""}]
[null,"Description",{"$f":"IF('Main Menu'!M19=\"\",\"\",'Main Menu'!M19)","v":""}]
[null,"Name/Initials of Respondent",{"$f":"IF('Main Menu'!M20=\"\",\"\",'Main Menu'!M20)","v":""}]
[]
[]
[]
[]
[]
{"$rows_left_out":17}
{"sheet":"Output Earthwork","index":7,"n_rows":69,"n_cols":7,"rows_kept":69,"cut":false,"hidden":true,"merged":[[53,3,53,6],[55,3,55,6],[57,3,57,6],[59,3,59,6],[61,3,61,6],[52,1,53,2],[54,1,55,2],[56,1,57,2],[58,1,59,2],[60,1,61,2],[51,1,51,2],[50,3,50,6],[21,1,21,2],[22,1,24,2],[25,1,27,2],[10,2,10,3],[14,2,14,3],[11,2,11,3],[13,2,13,3],[12,2,12,3],[20,3,20,6],[28,1,30,2],[40,1,42,2],[43,1,45,2],[46,1,48,2],[31,1,33,2],[34,1,36,2],[37,1,39,2]]}
[]
[]
[]
[]
[]
[]
[]
[]
[]
[]
[null,"Project ID",{"$f":"IF(Earthwork!C11=\"\",\" \",Earthwork!C11)","v":" "}]
[null,"Project Location",{"$f":"IF(Earthwork!C12=\"\",\" \",Earthwork!C12)","v":" "}]
[null,"Date",{"$f":"IF(Earthwork!C13=\"\",\" \",Earthwork!C13)","v":" "}]
[null,"Description",{"$f":"IF(Earthwork!C14=\"\",\" \",Earthwork!C14)","v":" "}]
[null,"Name/Initials of Respondent",{"$f":"IF(Earthwork!C15=\"\",\" \",Earthwork!C15)","v":" "}]
[]
[]
[]
[]
[]
{"$rows_left_out":50}
{"sheet":"HiddenEarthwork","index":8,"n_rows":209,"n_cols":22,"rows_kept":209,"cut":false,"hidden":true,"merged":[[204,7,204,8],[205,7,205,8],[206,7,206,8],[207,7,207,8],[208,7,208,8],[194,7,195,13],[4,17,4,18],[172,0,172,4],[5,8,5,9],[86,0,86,4],[103,0,103,4],[131,0,131,4],[150,0,150,4],[5,0,5,4],[23,0,23,4],[45,0,45,4],[66,0,66,4]]}
[]
[]
[]
[]
[null,null,null,null,null,null,null,null,null,null,null,null,null,null,null,null,null,"Boundaries"]
["Dependent Variable 1: Exacavation Truck",null,null,null,null,null,null,null,"x-new (user input)",null,null,null,null,"Estimate of Ῡ",null,null,null,"MIN","MAX"]
[]
["Factors","Estimated Coef.",null,null,null,null,null,null,"Possible values","Input x0",null,null,null,null,null,null,null,null,null,null,null,"Excavation Truck"]
["(Intercept)                                                   ",-141.5,null,null,null,null,null,"(Intercept)",1,1,null,null,null,{"$f":"B9*J9+B10*J10","v":-141.5},null,null,null,200,5000,null,"min",40]
["Size",967.8,null,null,null,null,null,"Size","1, 2 or 3",{"$f":"Earthwork!F24","v":0},null,null,null,null,null,null,null,null,null,null,"Q1",600]
[null,null,null,null,null,null,null,null,null,null,null,null,null,null,null,null,null,null,null,null,"Median",1500]
[null,null,null,null,null,null,null,null,null,null,null,null,null,null,null,null,null,null,null,null,"Q3",2400]
[null,null,null,null,null,null,null,null,null,null,null,null,null,null,null,null,null,null,null,null,"Max",5000]
[]
[null,null,null,null,null,null,null,null,null,null,null,null,null,null,null,null,null,null,null,null,"Box1 - hidden",{"$f":"V10","v":600}]
[null,null,null,null,null,null,null,null,null,null,null,null,null,null,null,null,null,null,null,null,"Box 2 - lower",{"$f":"V11-V10","v":900}]
[null,null,null,null,null,null,null,null,null,null,null,null,null,null,null,null,null,null,null,null,"Bow 3 - upper",{"$f":"V12-V11","v":900}]
[null,null,null,null,null,null,null,null,null,null,null,null,null,null,null,null,null,null,null,null,"Estimate x mark",{"$f":"N9","v":-141.5}]
[null,null,null,null,null,null,null,null,null,null,null,null,null,null,null,null,null,null,null,null,"Whisker Top",{"$f":"V13-V12","v":2600}]
[null,null,null,null,null,null,null,null,null,null,null,null,null,null,null,null,null,null,null,null,"Whisker Bottom",{"$f":"V10-V9","v":560}]
{"$rows_left_out":190}
{"sheet":"Asphalt Paving","index":9,"n_rows":39,"n_cols":6,"rows_kept":39,"cut":false,"hidden":true,"merged":[[42,5,44,5],[23,2,23,4],[24,2,24,4],[37,2,37,4],[36,2,36,4],[35,2,35,4],[34,2,34,4],[33,2,33,4],[32,2,32,4],[28,2,28,4],[38,2,38,4],[3,1,5,2],[25,2,25,4],[27,2,27,4],[26,2,26,4],[31,2,31,4],[30,2,30,4],[29,2,29,4]]}
[]
[]
[]
[]
[]
[]
[]
[]
[]
[]
[]
[]
[null,"Project ID",{"$f":"IF('Main Menu'!M16=\"\",\"\",'Main Menu'!M16)","v":""}]
[null,"Project Location",{"$f":"IF('Main Menu'!M17=\"\",\"\",'Main Menu'!M17)","v":""}]
[null,"Date",{"$f":"IF('Main Menu'!M18=\"\",\"\",'Main Menu'!M18)","v":""}]
[null,"Description",{"$f":"IF('Main Menu'!M19=\"\",\"\",'Main Menu'!M19)","v":""}]
[null,"Name/Initials of Respondent",{"$f":"IF('Main Menu'!M20=\"\",\"\",'Main Menu'!M20)","v":""}]
[]
[]
[]
{"$rows_left_out":20}
{"sheet":"Output AP","index":10,"n_rows":70,"n_cols":7,"rows_kept":70,"cut":false,"hidden":true,"merged":[[20,3,20,6],[20,1,20,2],[55,3,55,6],[57,3,57,6],[59,3,59,6],[21,1,21,2],[22,1,24,2],[25,1,27,2],[28,1,30,2],[31,1,33,2],[34,1,36,2],[43,1,45,2],[37,1,39,2],[40,1,42,2],[61,3,61,6],[63,3,63,6],[49,1,49,2],[48,1,48,2],[54,1,55,2],[56,1,57,2],[58,1,59,2],[60,1,61,2],[62,1,63,2],[48,3,48,6],[10,2,10,3],[14,2,14,3],[11,2,11,3],[13,2,13,3],[12,2,12,3]]}
[]
[]
[]
[]
[]
[]
[]
[]
[]
[]
[null,"Project ID",{"$f":"IF('Asphalt Paving'!C13=\"\",\" \",'Asphalt Paving'!C13)","v":" "}]
[null,"Project Location",{"$f":"IF('Asphalt Paving'!C14=\"\",\" \",'Asphalt Paving'!C14)","v":" "}]
[null,"Date",{"$f":"IF('Asphalt Paving'!C15=\"\",\" \",'Asphalt Paving'!C15)","v":" "}]
[null,"Description",{"$f":"IF('Asphalt Paving'!C16=\"\",\" \",'Asphalt Paving'!C16)","v":" "}]
[null,"Name/Initials of Respondent",{"$f":"IF('Asphalt Paving'!C17=\"\",\" \",'Asphalt Paving'!C17)","v":" "}]
[]
[]
[]
[]
[]
{"$rows_left_out":51}
{"sheet":"HiddenAP","index":11,"n_rows":174,"n_cols":22,"rows_kept":174,"cut":false,"hidden":true,"merged":[[173,7,173,8],[159,7,160,13],[169,7,169,8],[170,7,170,8],[171,7,171,8],[172,7,172,8],[138,0,138,4],[42,0,42,4],[62,0,62,4],[4,17,4,18],[5,0,5,4],[5,8,5,9],[24,0,24,4],[119,0,119,4],[82,0,82,4],[100,0,100,4]]}
[]
[]
[]
[]
[null,null,null,null,null,null,null,null,null,null,null,null,null,null,null,null,null,"Boundaries"]
["Dependent Variable 1: HMA Placement LL\n",null,null,null,null,null,null,null,"x-new (user input)",null,null,null,"Estimate of Ῡ",null,null,null,null,"MIN","MAX"]
[]
["Factors","Estimated Coef.",null,null,null,null,null,null,"Possible values","Input x0",null,null,null,null,null,null,null,null,null,null,null,"HMALL"]
["(Intercept)                                                   ",108.41,null,null,null,null,null,"(Intercept)",1,1,null,null,{"$f":"B9*J9+B10*J10","v":108.41},null,null,null,null,20,700,null,"min",20]
["Project Size",45.69,null,null,null,null,null,"ExpediatedSchedule ","1, 2 or 3",{"$f":"'Asphalt Paving'!F26","v":0},null,null,null,null,null,null,null,null,null,null,"Q1",119.5]
[null,null,null,null,null,null,null,null,null,null,null,null,null,null,null,null,null,null,null,null,"Median",180]
[null,null,null,null,null,null,null,null,null,null,null,null,null,null,null,null,null,null,null,null,"Q3",235]
[null,null,null,null,null,null,null,null,null,null,null,null,null,null,null,null,null,null,null,null,"Max",350]
[]
[null,null,null,null,null,null,null,null,null,null,null,null,null,null,null,null,null,null,null,null,"Box1 - hidden",{"$f":"V10","v":119.5}]
[null,null,null,null,null,null,null,null,null,null,null,null,null,null,null,null,null,null,null,null,"Box 2 - lower",{"$f":"V11-V10","v":60.5}]
[null,null,null,null,null,null,null,null,null,null,null,null,null,null,null,null,null,null,null,null,"Bow 3 - upper",{"$f":"V12-V11","v":55}]
[null,null,null,null,null,null,null,null,null,null,null,null,null,null,null,null,null,null,null,null,"Estimate x",{"$f":"M9","v":108.41}]
[null,null,null,null,null,null,null,null,null,null,null,null,null,null,null,null,null,null,null,null,"Whisker Top",{"$f":"V13-V12","v":115}]
[null,null,null,null,null,null,null,null,null,null,null,null,null,null,null,null,null,null,null,null,"Whisker Bottom",{"$f":"V10-V9","v":99.5}]
{"$rows_left_out":155}
{"sheet":"Concrete Paving","index":12,"n_rows":37,"n_cols":6,"rows_kept":37,"cut":false,"hidden":true,"merged":[[40,5,42,5],[33,2,33,4],[34,2,34,4],[35,2,35,4],[27,2,27,4],[28,2,28,4],[29,2,29,4],[30,2,30,4],[32,2,32,4],[36,2,36,4],[23,2,23,4],[25,2,25,4],[26,2,26,4],[24,2,24,4],[31,2,31,4]]}
[]
[]
[]
[]
[]
[]
[]
[]
[]
[]
[]
[]
[null,"Project ID",{"$f":"IF('Main Menu'!M16=\"\",\"\",'Main Menu'!M16)","v":""}]
[null,"Project Location",{"$f":"IF('Main Menu'!M17=\"\",\"\",'Main Menu'!M17)","v":""}]
[null,"Date",{"$f":"IF('Main Menu'!M18=\"\",\"\",'Main Menu'!M18)","v":""}]
[null,"Description",{"$f":"IF('Main Menu'!M19=\"\",\"\",'Main Menu'!M19)","v":""}]
[null,"Name/Initials of Respondent",{"$f":"IF('Main Menu'!M20=\"\",\"\",'Main Menu'!M20)","v":""}]
[]
[]
[]
{"$rows_left_out":18}
{"sheet":"Output CP","index":13,"n_rows":55,"n_cols":7,"rows_kept":55,"cut":false,"hidden":true,"merged":[[30,1,32,2],[33,1,35,2],[36,1,38,2],[10,2,10,3],[14,2,14,3],[11,2,11,3],[13,2,13,3],[12,2,12,3],[27,1,29,2],[20,1,20,2],[21,1,23,2],[24,1,26,2],[19,3,19,6],[40,3,40,6],[41,1,41,2],[46,1,47,2],[44,1,45,2],[42,1,43,2],[43,3,43,6],[45,3,45,6],[47,3,47,6]]}
[]
[]
[]
[]
[]
[]
[]
[]
[]
[]
[null,"Project ID",{"$f":"IF('Concrete Paving'!C13=\"\",\" \",'Concrete Paving'!C13)","v":" "}]
[null,"Project Location",{"$f":"IF('Concrete Paving'!C14=\"\",\" \",'Concrete Paving'!C14)","v":" "}]
[null,"Date",{"$f":"IF('Concrete Paving'!C15=\"\",\" \",'Concrete Paving'!C15)","v":" "}]
[null,"Description",{"$f":"IF('Concrete Paving'!C16=\"\",\" \",'Concrete Paving'!C16)","v":" "}]
[null,"Name/Initials of Respondent",{"$f":"IF('Concrete Paving'!C17=\"\",\" \",'Concrete Paving'!C17)","v":" "}]
[]
[]
[]
[]
[null,null,null,"Productivity Rates"]
{"$rows_left_out":36}
{"sheet":"Hidden CP","index":14,"n_rows":142,"n_cols":22,"rows_kept":142,"cut":false,"hidden":true,"merged":[[65,0,65,4],[85,0,85,4],[4,17,4,18],[5,0,5,4],[5,8,5,9],[24,0,24,4],[43,0,43,4],[129,7,130,13],[139,7,139,8],[140,7,140,8],[141,7,141,8],[104,0,104,4]]}
[]
[]
[]
[]
[null,null,null,null,null,null,null,null,null,null,null,null,null,null,null,null,null,"Boundaries"]
["Dependent Variable 1: Thick Concrete Paving\n",null,null,null,null,null,null,null,"x-new (user input)",null,null,null,"Estimate of Ῡ",null,null,null,null,"MIN","MAX"]
[]
["Factors","Estimated Coef.",null,null,null,null,null,null,"Possible values","Input x0",null,null,null,null,null,null,null,null,null,null,null,"Thick Paving"]
["(Intercept)                                                   ",852.3,null,null,null,null,null,"(Intercept)                                                   ",1,1,null,null,{"$f":"B9*J9+B10*J10+B11*J11+B12*J12+B13*J13+B14*J14+B15*J15+B16*J16+B17*J17+B18*J18","v":852.3},null,null,null,null,3000,11000,null,"min",173]
["Size",5779.1,null,null,null,null,null,"Size","1, 2 or 3",{"$f":"'Concrete Paving'!F25","v":0},null,null,null,null,null,null,null,null,null,null,"Q1",1500]
["Season",-5166.5,null,null,null,null,null,"Season","1, 2 or 3",{"$f":"'Concrete Paving'!F35","v":0},null,null,null,null,null,null,null,null,null,null,"Median",3500]
["Traffic Conditions",2643.8,null,null,null,null,null,"Traffic Conditions","1, 2 or 3",{"$f":"'Concrete Paving'!F30","v":0},null,null,null,null,null,null,null,null,null,null,"Q3",7350]
["Night Paving",3728.3,null,null,null,null,null,"Night Paving","1, 2 or 3",{"$f":"'Concrete Paving'!F27","v":0},null,null,null,null,null,null,null,null,null,null,"Max",12000]
["Typical Section",-2231.1999999999998,null,null,null,null,null,"Typical Section","1, 2 or 3",{"$f":"'Concrete Paving'!F34","v":0}]
["Staged Construction",-1644.4,null,null,null,null,null,"Staged Construction","1, 2 or 3",{"$f":"'Concrete Paving'!F36","v":0},null,null,null,null,null,null,null,null,null,null,"Box1 - hidden",{"$f":"V10","v":1500}]
["Storage Staging",4199.8999999999996,null,null,null,null,null,"Storage Staging","1, 2 or 3",{"$f":"'Concrete Paving'!F31","v":0},null,null,null,null,null,null,null,null,null,null,"Box 2 - lower",{"$f":"V11-V10","v":2000}]
["Project Constraints",-5000.6000000000004,null,null,null,null,null,"Project Constraints","1, 2 or 3",{"$f":"'Concrete Paving'!F33","v":0},null,null,null,null,null,null,null,null,null,null,"Bow 3 - upper",{"$f":"V12-V11","v":3850}]
["Materials Delivery",-1694.5,null,null,null,null,null,"Materials Delivery","1, 2 or 3",{"$f":"'Concrete Paving'!F32","v":0},null,null,null,null,null,null,null,null,null,null,"Estimate",{"$f":"M9","v":852.3}]
[null,null,null,null,null,null,null,null,null,null,null,null,null,null,null,null,null,null,null,null,"Whisker Top",{"$f":"V13-V12","v":4650}]
[null,null,null,null,null,null,null,null,null,null,null,null,null,null,null,null,null,null,null,null,"Whisker Bottom",{"$f":"V10-V9","v":1327}]
{"$rows_left_out":123}
{"sheet":"Miscellaneous Activities","index":15,"n_rows":42,"n_cols":6,"rows_kept":42,"cut":false,"hidden":true,"merged":[[28,2,28,4],[23,2,23,4],[24,2,24,4],[25,2,25,4],[26,2,26,4],[27,2,27,4],[29,2,29,4],[30,2,30,4],[31,2,31,4],[32,2,32,4],[33,2,33,4],[41,2,41,4],[45,5,47,5],[39,2,39,4],[34,2,34,4],[35,2,35,4],[36,2,36,4],[37,2,37,4],[38,2,38,4],[40,2,40,4]]}
[]
[]
[]
[]
[]
[]
[]
[]
[]
[]
[]
[]
[null,"Project ID",{"$f":"IF('Main Menu'!M16=\"\",\"\",'Main Menu'!M16)","v":""}]
[null,"Project Location",{"$f":"IF('Main Menu'!M17=\"\",\"\",'Main Menu'!M17)","v":""}]
[null,"Date",{"$f":"IF('Main Menu'!M18=\"\",\"\",'Main Menu'!M18)","v":""}]
[null,"Description",{"$f":"IF('Main Menu'!M19=\"\",\"\",'Main Menu'!M19)","v":""}]
[null,"Name/Initials of Respondent",{"$f":"IF('Main Menu'!M20=\"\",\"\",'Main Menu'!M20)","v":""}]
[]
[]
[]
{"$rows_left_out":23}
{"sheet":"Output Misc.","index":16,"n_rows":96,"n_cols":7,"rows_kept":96,"cut":false,"hidden":true,"merged":[[20,3,20,6],[31,1,33,2],[34,1,36,2],[25,1,27,2],[28,1,30,2],[10,2,10,3],[11,2,11,3],[12,2,12,3],[13,2,13,3],[14,2,14,3],[80,3,80,6],[82,3,82,6],[84,3,84,6],[86,3,86,6],[21,1,21,2],[22,1,24,2],[46,1,48,2],[37,1,39,2],[40,1,42,2],[43,1,45,2],[49,1,51,2],[52,1,54,2],[53,3,54,6],[57,3,57,6],[70,3,70,6],[72,3,72,6],[74,3,74,6],[76,3,76,6],[78,3,78,6],[60,3,60,6],[62,3,62,6],[64,3,64,6],[66,3,66,6],[68,3,68,6],[58,1,58,2],[85,1,86,2],[83,1,84,2],[81,1,82,2],[59,1,60,2],[61,1,62,2],[63,1,64,2],[65,1,66,2],[67,1,68,2],[69,1,70,2],[71,1,72,2],[73,1,74,2],[75,1,76,2],[77,1,78,2],[79,1,80,2]]}
[]
[]
[]
[]
[]
[]
[]
[]
[]
[]
[null,"Project ID",{"$f":"IF('Miscellaneous Activities'!C13=\"\",\" \",'Miscellaneous Activities'!C13)","v":" "}]
[null,"Project Location",{"$f":"IF('Miscellaneous Activities'!C14=\"\",\" \",'Miscellaneous Activities'!C14)","v":" "}]
[null,"Date",{"$f":"IF('Miscellaneous Activities'!C15=\"\",\" \",'Miscellaneous Activities'!C15)","v":" "}]
[null,"Description",{"$f":"IF('Miscellaneous Activities'!C16=\"\",\" \",'Miscellaneous Activities'!C16)","v":" "}]
[null,"Name/Initials of Respondent",{"$f":"IF('Miscellaneous Activities'!C17=\"\",\" \",'Miscellaneous Activities'!C17)","v":" "}]
[]
[]
[]
[]
[]
{"$rows_left_out":77}
{"sheet":"Hidden Misc.","index":17,"n_rows":247,"n_cols":16,"rows_kept":247,"cut":false,"hidden":true,"merged":[[178,0,178,4],[197,0,197,4],[121,0,121,4],[140,0,140,4],[159,0,159,4],[6,0,6,4],[5,8,5,9],[25,0,25,4],[102,0,102,4],[45,0,45,4],[63,0,63,4],[82,0,82,4],[223,7,224,13],[243,7,243,8],[244,7,244,8],[245,7,245,8],[246,7,246,8],[238,7,238,8],[239,7,239,8],[240,7,240,8],[241,7,241,8],[242,7,242,8],[233,7,233,8],[234,7,234,8],[235,7,235,8],[236,7,236,8],[237,7,237,8]]}
[]
[]
[]
[]
[]
[null,null,null,null,null,null,null,null,"x-new (user input)",null,null,null,"Estimate of Ῡ"]
["Dependent Variable 1: FramesGrates"]
[]
["Factors","Estimated Coef.",null,null,null,null,null,null,"Possible values","Input x0",null,null,null,null,null,"Frames and Grates"]
["(Intercept)                                                   ",71.150999999999996,null,null,null,null,null,"(Intercept)",1,1,null,null,{"$f":"B10*J10+B11*J11","v":71.150999999999996},null,"min",1]
["Duration",-21.872,null,null,null,null,null,"Duration","1, 2 or 3",{"$f":"'Miscellaneous Activities'!F36","v":0},null,null,null,null,"Q1",4.5]
[null,null,null,null,null,null,null,null,null,null,null,null,null,null,"Median",12]
[null,null,null,null,null,null,null,null,null,null,null,null,null,null,"Q3",18]
[null,null,null,null,null,null,null,null,null,null,null,null,null,null,"Max",74]
[]
[null,null,null,null,null,null,null,null,null,null,null,null,null,null,"Box1 - hidden",{"$f":"P11","v":4.5}]
[null,null,null,null,null,null,null,null,null,null,null,null,null,null,"Box 2 - lower",{"$f":"P12-P11","v":7.5}]
[null,null,null,null,null,null,null,null,null,null,null,null,null,null,"Bow 3 - upper",{"$f":"P13-P12","v":6}]
[null,null,null,null,null,null,null,null,null,null,null,null,null,null,"Estimate",{"$f":"M10","v":71.150999999999996}]
[null,null,null,null,null,null,null,null,null,null,null,null,null,null,"Whisker Top",{"$f":"P14-P13","v":56}]
{"$rows_left_out":227}